laravel54 下运行 cnpm run dev 报错!_PHP_编程问答

laravel54 下运行 cnpm run dev 报错!

来源:互联网  时间:2017/6/30 16:11:29

关于网友提出的“ laravel54 下运行 cnpm run dev 报错!”问题疑问,本网通过在网上对“ laravel54 下运行 cnpm run dev 报错!”有关的相关答案进行了整理,供用户进行参考,详细问题解答如下:

问题: laravel54 下运行 cnpm run dev 报错!
描述:

错误信息如下,希望大神们帮忙看一下!谢谢!!

Error: Cannot find module '/Users/zhangchunbo/www/coding98/node_modules/laravel-mix/setup/webpack.config.js'
    at Function.Module._resolveFilename (module.js:470:15)
    at Function.Module._load (module.js:418:25)
    at Module.require (module.js:498:17)
    at require (internal/module.js:20:19)
    at requireConfig (/Users/zhangchunbo/www/coding98/node_modules/webpack/bin/convert-argv.js:96:18)
    at /Users/zhangchunbo/www/coding98/node_modules/webpack/bin/convert-argv.js:109:17
    at Array.forEach (native)
    at module.exports (/Users/zhangchunbo/www/coding98/node_modules/webpack/bin/convert-argv.js:107:15)
    at Object.<anonymous> (/Users/zhangchunbo/www/coding98/node_modules/webpack/bin/webpack.js:153:40)
    at Module._compile (module.js:571:32)

npm ERR! Darwin 15.0.0
npm ERR! argv "/usr/local/Cellar/node/7.9.0/bin/node" "/usr/local/bin/npm" "run" "development"
npm ERR! node v7.9.0
npm ERR! npm  v4.2.0
npm ERR! code ELIFECYCLE
npm ERR! errno 1
npm ERR! @ development: `cross-env NODE_ENV=development node_modules/webpack/bin/webpack.js --progress --hide-modules --c/laravel-mix/setup/webpack.config.js`
npm ERR! Exit status 1
npm ERR! 
npm ERR! Failed at the @ development script 'cross-env NODE_ENV=development node_modules/webpack/bin/webpack.js --progress --hide-modules --c/laravel-mix/setup/webpack.config.js'.
npm ERR! Make sure you have the latest version of node.js and npm installed.
npm ERR! If you do, this is most likely a problem with the  package,
npm ERR! not with npm itself.
npm ERR! Tell the author that this fails on your system:
npm ERR!     cross-env NODE_ENV=development node_modules/webpack/bin/webpack.js --progress --hide-modules --c/laravel-mix/setup/webpack.config.js
npm ERR! You can get information on how to open an issue for this project with:
npm ERR!     npm bugs 
npm ERR! Or if that isn't available, you can get their info via:
npm ERR!     npm owner ls 
npm ERR! There is likely additional logging output above.

npm ERR! Please include the following file with any support request:
npm ERR!     /Users/zhangchunbo/.npm/_logs/2017-06-28T11_47_29_253Z-debug.log

npm ERR! Darwin 15.0.0
npm ERR! argv "/usr/local/Cellar/node/7.9.0/bin/node" "/usr/local/lib/node_modules/cnpm/node_modules/.bin/npm" "--userc/zhangchunbo/.cnpmrc" "--disturl=https://npm.taobao.org/mirrors/node" "--registry=https://registry.npm.taobao.org" "run" "dev"
npm ERR! node v7.9.0
npm ERR! npm  v3.10.10
npm ERR! code ELIFECYCLE
npm ERR! @ dev: `npm run development`
npm ERR! Exit status 1
npm ERR! 
npm ERR! Failed at the @ dev script 'npm run development'.
npm ERR! Make sure you have the latest version of node.js and npm installed.
npm ERR! If you do, this is most likely a problem with the  package,
npm ERR! not with npm itself.
npm ERR! Tell the author that this fails on your system:
npm ERR!     npm run development
npm ERR! You can get information on how to open an issue for this project with:
npm ERR!     npm bugs 
npm ERR! Or if that isn't available, you can get their info via:
npm ERR!     npm owner ls 
npm ERR! There is likely additional logging output above.

npm ERR! Please include the following file with any support request:
npm ERR!     /Users/zhangchunbo/www/coding98/npm-debug.log

运行cnpm install 报如下错误;

? tunneling socket could not be established, cause=connect EHOSTUNREACH 0.0.31.182:80 - Local (192.168.1.103:49803)
  ? mozjpeg pre-build test failed
  ? compiling from source

重新设置了代理产生了新的错误:

npm config set proxy http://proxy.company.com:8080
npm config set https-proxy http://proxy.company.com:8080

错误如下:

上一篇代码在本地运行没问题,可部署到服务器上出现error:100AE081:elliptic curve routines
下一篇PHP 关于 new 的使用
明星图片
相关文章
《 laravel54 下运行 cnpm run dev 报错!》由码蚁之家搜集整理于网络,
联系邮箱:mxgf168#qq.com(#改为@)